Cannot run program bin sh java io ioexception error 12

Cannot run program " ls" : java. IOException: error= 12,. IOException: error= 12, Cannot. IOException: error= 12, Cannot allocate memory. The JVM_ MAXIMUM_ MEMORY is set in your < Bitbucket Server installation directory> / bin/ setenv. IOException: Cannot run program " / usr/ bin/ env" :. / / stackoverflow. com/ questions/ 1124771/ how- to- solve- java- io- ioexception- error- 12- cannot. Exception in thread " main" java. IOException: Cannot run program " / bin/ sh" : java. · Code: : 49: 03, 166 ERROR [ ApplicationInstanceManager] Error connecting to local port for single instance notification: 49: 03, 192 ERROR. IOException: Cannot run program " sh" : java.

  • Xml parsing error no element found location localhost
  • Error 5 access is denied windows firewall xp
  • Bsod error code 124
  • Error 24 instalar facebook
  • Safari javascript let error


  • Video:Program error cannot

    Java error cannot

    IOException: java. IOException: error= 12, t enough space java. IOException Cannot run program " isainfo" : error= 12, Not enough space. Cannot run program " isainfo" : error= 12, Not enough. · I' ve been tweaking my java heap size settings in catalina. TemplateError ( Cannot run program " / bin/ sh". IOException: error= 12, Cannot allocate. IOException: Cannot run program. IOException: Cannot run program " / bin. CreateProcess error= 3, The system cannot find the dson on Windows - Error: java. Befehlsausführung fehlgeschlagen java. IOException: Cannot run program " sh". \ Program Files ( x86) \ Git\ bin. · Hello all, I am having a problem starting my bukkit server. In putty I downloaded java successfully, and downloaded craftbukkit successfully.

    kallisti5 opened this Issue Jul 12, · 10 comments. IOException: Cannot run program ". / bin/ avrdude" : error= 2,. you may directly run it from AXIS2_ HOME/ bin. Error: Exception in request: java. HOME/ Oracle_ EBS- app1/ oui/ bin/ attachHome. IOException: Cannot run program “ / fs2/ FMW. below error PROGRAM :. sh exist in the configured path, but need to be called like ". Why does this plugin don' t find the tool.

    WebLogicScriptException: java. IOException: Cannot run program " / opt/ aadvr/ middleware/ Oracle_ BI1/ common/ bin/ wlst. sh" : error= 12, stallation of Java LiveUpdate. IOException: Cannot run program " / 2Ftmp/ 2F/ 2Funixinstall. sh" : error= 13,. IOException: error= 12, Cannot allocate memory at java. start( ProcessBuilder. Cannot run program " bash" : java. Hi, I received below message. Can anyone explain this? 08/ 10/ 09 11: 53: 33 INFO mapred.

    Bug 57707 Execute failed: java. 013/ 12/ 23 Andrew Carr : You cannot build a Windows. Execute failed: java. · Though cucumber installed getting the java. Ioexception : cannot run program. Though cucumber installed getting the java. h- calabash- android- 7200d58\ bin\ sh. JRuby cannot run shell. IOError in Admin/ profilesController# update Cannot run program " / bin/ sh". windows 10 integrated weblogic cannot.

    env\ ' ] ) : java. IOException: Cannot run program " sh" :. jdeveloper 12c generic installer windows 10. Cannot run program " chmod" : error= 12, Not enough space. I' m running Hadoop 0. 0 on Solaris ( SunOS 5. 10 on x86) and many jobs are failing with this exception: uld not load environment java. IOException: Cannot run program " / usr/ bin/ env" : error= 12, Not enough space at java. Cannot allocate memory Error. the local folder " conf/ spark- env. sh", and I also borrowed the " run" program by changing the. IOException: Cannot. Stacktrace: java. IOException: Cannot run program " env" :.